DirectFB - Home of the pragmatist Roadmap


[directfb-users] compilation problem with 0.9.21 release
Mailing List archive

[Date Prev][Date Next][Thread Prev][Thread Next][Date Index][Thread Index]

[directfb-users] compilation problem with 0.9.21 release



Hi,
I am having a problem compiling the 0.9.21 release when trying
to compile static libraries:

creating libdirectfb_fbdev.la
(cd .libs && rm -f libdirectfb_fbdev.la && ln -s
../libdirectfb_fbdev.la libdirectfb_fbdev.la)
make[3]: *** No rule to make target `libdirectfb_fbdev.o',
needed by `all-am'.  Stop.
make[3]: Leaving directory `/root/DirectFB-0.9.21/systems/fbdev'
make[2]: *** [all-recursive] Error 1
make[2]: Leaving directory `/root/DirectFB-0.9.21/systems'
make[1]: *** [all-recursive] Error 1
make[1]: Leaving directory `/root/DirectFB-0.9.21'
make: *** [all-recursive-am] Error 2

I do not see this problem when compiling with shared libraries.
Anyone have an idea what I am doing wrong,
Thanks...


		
__________________________________ 
Do you Yahoo!? 
All your favorites on one personal page  Try My Yahoo!
http://my.yahoo.com 




Home | Main Index | Thread Index


directfb.org / Development / Old Archives